Apastron
type: Concept
contributor: AAS Frey.Katie
broader: Apsides
definition: The point at which a binary star is furthest from its companion.
modified: 2020-11-03T18:04:15.145Z
modified: 2020-11-03T18:03:54.448Z

Apsides
type: Concept
narrower: Apastron