Gravitational fields
type: Concept
contributor: AAS Frey.Katie Admin
alternative label: Gravity field
broader: Newtonian gravitation
definition: The region of space in which gravitational attraction exists.
modified: 2020-11-02T15:55:28.38Z
modified: 2020-11-02T15:55:16.775Z

Newtonian gravitation
type: Concept
narrower: Gravitational fields