Active galaxies
type: Concept
narrower: Haro galaxies

Haro galaxies
type: Concept
contributor: AAS Frey.Katie Admin
broader: Active galaxies
definition: A type of galaxies characterized by strong emission in the blue and violet regions of the spectrum. They are often elliptical or lenticular.
modified: 2020-11-02T16:05:49.676Z
modified: 2020-11-02T16:05:37.476Z