Heliosphere
type: Concept
narrower: Heliosheath

Heliosheath
type: Concept
contributor: AAS Frey.Katie
broader: Heliosphere
definition: The region located between the termination shock and the heliopause where the turbulent and hot solar wind is compressed as it passes outward against the interstellar wind.
modified: 2020-11-09T16:14:29.566Z
modified: 2020-11-09T16:14:14.801Z