Hierarchical cosmology
type: Concept
contributor: AAS Frey.Katie
broader: Cosmology
definition: A cosmology characterized by clustering of galaxy clusters in increasingly larger systems.
modified: 2020-11-09T16:37:09.054Z
modified: 2020-11-09T16:36:55.624Z

Cosmology
type: Concept
narrower: Hierarchical cosmology