Hubble-Lemaitre law
type: Concept
narrower: Hubble diagram

Hubble diagram
type: Concept
contributor: AAS Frey.Katie
broader: Hubble-Lemaitre law
definition: A plot of the redshift of galaxies against their distance or against their apparent magnitude.
modified: 2020-11-09T16:48:01.391Z
modified: 2020-11-09T16:47:51.519Z