Infrared excess
type: Concept
definition: Infrared emission from a star in excess of that expected from a blackbody with the temperature corresponding to the temperature of the star.
broader: Infrared astronomy
alternative label: IR excess
alternative label: IR excess stars
contributor: AAS Frey.Katie
modified: 2020-11-09T16:59:18.911Z
modified: 2020-11-09T16:59:29.315Z

Infrared astronomy
type: Concept
narrower: Infrared excess