Infrared telescopes
type: Concept
contributor: AAS Frey.Katie Admin
alternative label: IR telescopes
broader: Space telescopes
definition: A telescope capable of observing infrared radiation from astronomical objects.
modified: 2020-11-02T19:43:47.828Z
modified: 2020-11-02T19:43:34.37Z

Space telescopes
type: Concept
narrower: Infrared telescopes