Lunar features
type: Concept
narrower: Lunar domes

Lunar domes
type: Concept
contributor: AAS Frey.Katie
broader: Lunar features
definition: Rounded volcanic structure on the Moon produced by eruption or intrusion of viscous high-silica magma. An uplift that is round or elliptical in map view of the Moon with beds dipping away in all directions from a central point.
modified: 2020-11-10T18:44:03.888Z
modified: 2020-11-10T18:43:52.541Z