Heliophysics
type: Concept
notation: missionsHelioSCI
type: NamedIndividual
narrower: Proba-2

Proba-2
type: Concept
broader: Heliophysics
is leaf concept: true
in scheme: ESA Data Ontology
definition: PROBA2 is a microsatellite launched on 2 November 2009 as part of ESA’s in-orbit Technology Demonstration Programme. The mission includes solar and space weather experiments that were selected in mid-2002 following an open ESA Announcement of Opportunity within ESA’s Space Science Directorate. The PROBA2 Mission Operations Centre (MOC) is situated in Redu, Belgium. The PROBA2 Science Centre (P2SC) operates the two main scientific instruments, the EUV imager (SWAP) and the Large Yield Radiometer (LYRA) from the Royal Observatory of Belgium, Brussels. The engineering, calibrated and derived data products of SWAP and LYRA are freely from this interface as part of ESA’s Heliospheric Archive at ESAC. PROBA stands for 'PRoject for Onboard Autonomy', which is part of ESA's in-orbit Technology Demonstration programme. Following up on the success of PROBA1, PROBA2 hosts 17 new technological developments and 4 scientific instruments. Among the platform elements and experiments to be technologically demonstrated on PROBA2 are the new powerful ADPMS on-board computer, AOCS subsystems, highly integrated avionics and power units, a star tracker, sun sensors, a propulsion subsystem, Li-ion batteries, reaction wheels and an advanced stellar compass. The science payload on-board PROBA2 consists of two main solar instruments (SWAP and LYRA) and two instruments to observe the space environment in the immediate vicinity of the spacecraft (DSLP and TPMU). With these instruments we aim at identifying and studying all events on the Sun that might have implications on the solar-terrestrial connection, both through imaging (SWAP) as well as through irradiance measurements (LYRA). In particular, the focus of the PROBA2 mission is the genesis and evolution of events that can affect space weather, such as coronal mass ejections, EUV waves, EUV dimmings, and solar flares. However, PROBA2 also provided wide-field observations of the large-scale evolution of the solar corona and the long-term var…
modified: 2023-05-08T18:00:00+00:00

ESA Data Ontology
type: ConceptScheme
type: Ontology

isLeafConcept
definition: The :isLeafConcept property marks whether a SKOS concept is a leaf SKOS concept.