SOIL COLOR
type: Concept
change note: 2017-03-10 09:14:19.0 [tstevens] update Definition (The property of a soil that is based upon three components of hue, chroma (intensity or brightness), and value (lightness or darkness).); update Definition (The Nature and Properties of Soils, Prentice Hall, 1996. );
in scheme: sciencekeywords
definition: The property of a soil that is based upon three components of hue, chroma (intensity or brightness), and value (lightness or darkness).

SOILS
type: Concept