Positioning/Navigation
type: Concept

GYROS
type: Concept
in scheme: instruments
definition: GYROS are compass systems that do not depend on magnetism but uses a gyroscope instead; a rotating mechanism in the form of a universally mounted spinning wheel that offers resistance to turns in any direction.