SOIL TEMPERATURE
type: Concept
change note: 2021-08-31 08:35:20.0 [tstevens] update Definition (The degree of hotness or coldness of the soil as measured on some definite temperature scale.); update Definition (The Nature and Properties of Soils, Prentice Hall, 1996.);
in scheme: sciencekeywords
definition: The degree of hotness or coldness of the soil as measured on some definite temperature scale.

FROZEN GROUND
type: Concept