SOLRAD-7A
type: Concept
in scheme: platforms
definition: Solrad 7A Characteristics: Designation: 00730 / 64001D Launch date: 11 Jan 1964 Country of origin: United States Mission: Scientific Perigee/Apogee: 900/921 km Inclination: 69.9 degrees Period: 103.2 min Launch vehicle: Thor Agena Launch site: Vandenberg Group: Platform_Details Entry_ID: SOLRAD-7A Group: Platform_Identification Platform_Category: Solar/Space Observation Satellites Platform_Series_or_Entity: SOLRAD Short_Name: SOLRAD-7A Long_Name: Solar Radiation-7A End_Group Group: Synonymous_Platform_Names Short_Name: solrad-7a End_Group Group: Platform_Associated_Instruments Short_Name: SXP End_Group Group: Orbit Orbit_Inclination: 69.9 degrees Period: 103.2 minutes Perigee: 900 km Apogee: 921 km End_Group Creation_Date: 2008-01-14 Online_Resource: http://nssdc.gsfc.nasa.gov/nmc/experimentDisplay.do?id=1964-001D-01 Group: Platform_Logistics Launch_Date: 1964-01-11 Launch_Site: Vandenberg Air Force Base, USA Primary_Sponsor: NASA End_Group End_Group

Solar Radiation (SOLRAD)
type: Concept