WA/TPL
type: Concept
in scheme: providers
definition: Welcome to the Tacoma Public Library! As one of the most important educational and cultural institutions in the city, the Tacoma Public Library is an essential resource for the residents of the city of Tacoma. Who uses the Library? Everyone. There is hardly an institution in Tacoma that affects more lives than the Tacoma Public Library … the possibilities are endless. No matter where you are, or what time of day it is, library access is available either at a local library or through this website. The best place to start ... Get your Tacoma Public Library card! Here you can learn everything you need to know about taking full advantage of the library's many services, programs and resources! Summary provided by http://www.tpl.lib.wa.us/Page.aspx?nid=8

WASHINGTON
type: Concept