PRECIPITATION AMOUNT
type: Concept

3 AND 6 HOUR PRECIPITATION AMOUNT
type: Concept
change note: 2014-04-15 09:51:06.0 [128.183.164.42] added definition insert Definition (id: null text: The amount of precipitation collected and measured at a weather observing site during 3 hour and 6 hour periods. language code: en);
change note: 2014-04-14 14:25:47.0 [128.183.164.42] Insert Concept add broader relation (3 AND 6 HOUR PRECIPITATION AMOUNT [039bbfd2-7653-4ba8-9003-b46d367c6038,106315] - PRECIPITATION AMOUNT [cad5c02a-e771-434e-bef6-8dced38a68e8,84205]);
in scheme: sciencekeywords
definition: The amount of precipitation collected and measured at a weather observing site during 3 hour and 6 hour periods.