Conductivity Sensors
type: Concept

CONDUCTIVITY METERS
type: Concept
change note: 2021-08-04 18:08:37.0 [sritz] insert AltLabel (id: null category: primary text: CONDUCTIVITY METERS language code: en);
in scheme: instruments
definition: CONDUCTIVITY METERS are devices that measure the units of electrical conduction (the facility with which a substance conducts electricity, as represented by the current density per electrical-potential gradient in the direction of flow).