DTI-UK/SEP/WAVEGEN
type: Concept
in scheme: providers
definition: :: We are a world leader in wave energy and wave power.. We developed and operate Limpet, the world’s first commercial-scale wave energy device that generates wave energy for the grid. :: Rising demand for energy and the finite nature of conventional fuels, are leading to increased prices. The problem of green house gas emissions continues. Harnessing the immense wave power in the world’s oceans can be part of the solution to our energy problems. At Wavegen we are delivering the wave energy technology to help make that happen. :: Our marine renewable wave power specialists offer a unique blend of engineering, scientific and commercial skills. Summary provided by http://www.wavegen.co.uk/

COMMERCIAL
type: Concept