ATMOSPHERIC CARBON DIOXIDE
type: Concept

CARBON DIOXIDE PROFILES
type: Concept
change note: 2021-03-02 09:24:14.0 [tstevens] insert Definition (id: null text: A graph showing the variation of a meteorological event with height. language code: en);
change note: 2021-02-26 08:40:56.0 [tstevens] Move Concepts delete broader relation (null); add broader relation (CARBON DIOXIDE PROFILES [03ddc432-906d-4469-bb00-179c828dbea4,560865] - ATMOSPHERIC CARBON DIOXIDE [c3b81888-8a39-4b3f-8033-4c077797bcba,83947]);
change note: 2021-02-26 08:40:36.0 [tstevens] Insert Concept add broader relation (CARBON DIOXIDE PROFILES [03ddc432-906d-4469-bb00-179c828dbea4,560865] - CARBON AND HYDROCARBON COMPOUNDS [19ab681c-bdd7-4793-bbdb-1ec498575314,83945]);
in scheme: sciencekeywords
definition: A graph showing the variation of a meteorological event with height.