TROPICAL CYCLONES
type: Concept

TROPICAL DEPRESSION MOTION
type: Concept
change note: 2016-07-31 21:45:20.0 [saritz] insert Definition (id: null text: Change in Tropical Depression's position with respect to time. language code: en);
change note: 2016-07-31 17:42:03.0 [saritz] Move Concepts delete broader relation (null); add broader relation (TROPICAL DEPRESSION MOTION [03e9cfd2-631c-42e6-b25c-b75f57e4ebb8,247479] - TROPICAL CYCLONES [06180441-d4bb-4fed-b36a-9b3cb2cac0fe,217775]);
change note: 2016-07-31 17:38:53.0 [saritz] Insert Concept add broader relation (TROPICAL DEPRESSION MOTION [03e9cfd2-631c-42e6-b25c-b75f57e4ebb8,247479] - TROPICAL DEPRESSION [3e7a4686-8255-4046-ab3a-b2da5e450aed,217785]);
in scheme: sciencekeywords
definition: Change in Tropical Depression's position with respect to time.