AEOLIAN PROCESSES
type: Concept

DEFLATION
type: Concept
change note: 2013-08-20 10:12:54.0 [tbs1979] insert Definition (id: null text: Processes pertain to the activity of the winds and more specifically, to the winds' ability to shape the surface of the Earth and other planets. Winds may erode, transport, and deposit materials, and are effective agents in regions with sparse vegetation and a large supply of unconsolidated sediments. language code: en);
change note: 2013-08-05 14:12:11.0 [tbs1979] Insert Concept add broader relation (DEFLATION [03ea18fe-793d-48e0-aa44-e211376c73d8,105441] - AEOLIAN PROCESSES [3ab3aa92-9cca-4660-a0ed-281fff07eede,84207]);
in scheme: sciencekeywords
definition: Processes pertain to the activity of the winds and more specifically, to the winds' ability to shape the surface of the Earth and other planets. Winds may erode, transport, and deposit materials, and are effective agents in regions with sparse vegetation and a large supply of unconsolidated sediments.