ACADEMIC
type: Concept

UTN-K/EECS
type: Concept
in scheme: providers
definition: The University of Tennessee's flagship campus in Knoxville boasts a vigorous research agenda engaging scholars and students with expertise in issues vital to local and global interests. UT Knoxville is the hub of a vibrant research community that includes Oak Ridge National Laboratory and other University of Tennessee System campuses and institutes. Engineers and scientists are actively engaged in the following areas of research: 1. Advanced Imaging and Collaborative Information Processing 2. Analog VLSI and Devices Laboratory 3. Antennas and Microwave Systems 4. Distributed Intelligence Laboratory 5. Emergent Computation Project 6. Innovative Computing Laboratory 7. Integrated Circuits and Systems Laboratory 8. Laboratory for Information Technologies 9. Logistical Computing and Internetworking Laboratory 10. Machine Intelligence Lab & Networking Research Group 11. Microelectronic Systems 12. National Institute for Mathematical and Biological Synthesis (NIMBioS) 13. Power Engineering Laboratory 14. Software Quality Research Lab [Summary provided by the The University of Tennessee.] 9.