SURFACE WATER PROCESSES/MEASUREMENTS
type: Concept

WATER YIELD
type: Concept
change note: 2016-04-04 09:39:49.0 [gee-cee] update Definition (The processes involved in the amount of water released from a flowing body of water.); update Definition (Goudie, Andrew. 1997. The Encyclopedic Dictionary of Physical Geography. Blackwell Publishing, Malden, Massachusetts. );
change note: 2016-03-31 08:14:45.0 [gee-cee] Move Concepts delete broader relation (null); add broader relation (WATER YIELD [04922ba6-8f00-4f54-b80c-ce2414c91e2e,86189] - SURFACE WATER PROCESSES/MEASUREMENTS [9d86cd70-062a-4c39-b3f3-226abebc07f7,158723]);
in scheme: sciencekeywords
definition: The processes involved in the amount of water released from a flowing body of water.