CONSORTIA/INSTITUTIONS
type: Concept

SCRIPPS/GEOSCI
type: Concept
in scheme: providers
definition: The Geosciences Research Division at Scripps Institution of Oceanography is a multi-disciplinary group specializing in many aspects of geoscience research. Website: "http://grd.ucsd.edu/" [Summary provided by Scripps Institution of Oceanography, Geosciences Research Division.]