PacIOOS
type: Concept
change note: 2014-04-09 05:21:25.0 [128.183.164.42] added new data provider insert AltLabel (id: null text: Pacific Islands Ocean Observing System language code: en);
change note: 2014-04-09 05:18:48.0 [128.183.164.42] Insert Concept add broader relation (PacIOOS [05972963-8552-4fde-b574-90ac9768ea03,106283] - CONSORTIA/INSTITUTIONS [aef2fc80-def0-46a4-9259-9dc37e80ed08,66451]);
in scheme: providers
definition: PacIOOS is one of eleven regional observing programs in the U.S. that are supporting the emergence of the U.S. Integrated Ocean Observing System (IOOS®) under the National Oceanographic Partnership Program (NOPP). The PacIOOS region includes the U.S. Pacific Region (Hawai‘i, Guam, American Samoa, Commonwealth of the Northern Mariana Islands), the Pacific nations in Free Association with the U.S. (Republic of the Marshall Islands, Federated States of Micronesia, Republic of Palau), and the U.S. Minor Outlying Islands (Howland, Baker, Johnston, Jarvis, Kingman, Palmyra, Midway, Wake). Development of PacIOOS is guided through a collaborative governance framework and the program is administered and executed by the University of Hawai‘i School of Ocean and Earth Science and Technology (SOEST). With major funding from the National Oceanic and Atmospheric Administration (NOAA), SOEST, and the State of Hawai‘i, PacIOOS works to develop the observational, modeling, data management, and outreach components of an end-to-end ocean observing system to generate products that help to ensure a safe, clean, and productive ocean and a resilient coastal zone for the U.S. Pacific Islands.

CONSORTIA/INSTITUTIONS
type: Concept