ACADEMIC
type: Concept

UC-SB/NCEAS/KDE
type: Concept
in scheme: providers
definition: Kids do Ecology consists of NCEAS' scientists adopting local 5th grade classes and, together with the students, exploring specific ecology problems (questions and hypotheses) through the collection, analysis and interpretation of empirical data. Website: http://www.nceas.ucsb.edu/fmt/doc?/nceas-web/center Info: KDE