STORM SURGE
type: Concept
in scheme: sciencekeywords
definition: A rise above normal sea level on the coast where the Ekman effect, from strong winds, causes the shallow waters to pile up against the shore.

TIDES
type: Concept