DIFFUSION
type: Concept
in scheme: sciencekeywords
definition: In the oceans, a mixing process through which a component of seawater (e.g. salt) is transferred from a zone of higher concentration to a zone of lesser concentration.

OCEAN HEAT BUDGET
type: Concept