RU/PINRO
type: Concept
in scheme: providers
definition: The Northern Branch of PINRO (SevPINRO) was established in 1963. Since its foundation the main directions of the works have been the study of the fish, marine mammals and seaweed stock status, marine mammals and seaweed in the White Sea and in coastal areas of the Barents Sea, marine mammals in the Kara and Greenland Seas; working up of the recommendation for the rational fishery; improvement of the sea plants and marine animals processing. The seaweed aquaculture studies, salmon and shellfish investigations have been conducted. Summary Provided By: http://enc.ex.ru/cgi-bin/n1firm.pl?lang=2&f=2787

RUSSIA
type: Concept