WATER STORAGE
type: Concept
change note: 2020-05-07 14:45:29.0 [tstevens] Insert Concept add broader relation (WATER STORAGE [0692f19d-55bc-4fd7-8bf8-a0224e8715f9,560033] - INFRASTRUCTURE [d4313915-2d24-424c-a171-30ee9a6f4bb5,83397]);
in scheme: sciencekeywords
definition: Methods to store water for human consumption or agricultural use.

INFRASTRUCTURE
type: Concept