DROUGHT/PRECIPITATION RECONSTRUCTION
type: Concept
change note: 2012-07-26 11:24:13.0 [mpmorahan] insert Definition (id: null text: Reconstruction of past drought and precipitation climatic conditions based on paleoclimate proxy records (mostly tree ring data). language code: en);
change note: 2012-06-27 08:39:54.0 [mpmorahan] Insert Concept add broader relation (DROUGHT/PRECIPITATION RECONSTRUCTION [06bcba40-6046-4c0e-aa38-8f83410b93f0,40155] - PALEOCLIMATE RECONSTRUCTIONS [6f6423e8-ab4e-4572-8982-d9c40f64e28b,40149]);
in scheme: sciencekeywords
definition: Reconstruction of past drought and precipitation climatic conditions based on paleoclimate proxy records (mostly tree ring data).

PALEOCLIMATE RECONSTRUCTIONS
type: Concept