UMD/GLAD
type: Concept
change note: 2022-12-20 11:14:19.0 [tstevens] insert AltLabel (id: null category: primary text: Global Land Disturbance Mapping for JPL OPERA (Observational Products for End-Users from Remote Sensing Analysis), University of Maryland language code: en); insert Definition (id: null text: The Global Land Analysis and Discovery (GLAD) laboratory in the Department of Geographical Sciences at the University of Maryland investigates methods, causes and impacts of global land surface change. Earth observation imagery are the primary data source and land cover extent and change the primary topic of interest. language code: en);
change note: 2022-12-20 11:12:17.0 [tstevens] Insert Concept add broader relation (UMD/GLAD [06e0386c-0c62-479c-ba21-c14ccb2c3f5e,1158503] - ACADEMIC [7700280b-68ee-4644-bf5e-84e7a6adf897,1144530]);
in scheme: providers
definition: The Global Land Analysis and Discovery (GLAD) laboratory in the Department of Geographical Sciences at the University of Maryland investigates methods, causes and impacts of global land surface change. Earth observation imagery are the primary data source and land cover extent and change the primary topic of interest.

ACADEMIC
type: Concept