ACADEMIC
type: Concept

CLEMSON/AGBIOENG
type: Concept
in scheme: providers
definition: The Department of Agricultural and Biological Engineering is an academic unit of professionals who discover, adapt and disseminate knowledge and technologies. The focus is to enhance and sustain human and natural resources by integrating the basic biological and physical science and engineering principles with food, fiber and environmental systems. Website: "http://www.clemson.edu/agbioeng/" [Summary provided by Clemson University.]