G - I
type: Concept

GLACE
type: Concept
change note: 2018-12-04 13:17:07.0 [sritz] insert Definition (id: null text: Greenland Circumnavigation Expedition; Description: The Greenland Circumnavigation Expedition (GLACE) will provide access to the remote and as yet critically understudied Northern Greenland area and provide a unique opportunity to investigate the marine, terrestrial, atmospheric, and cryospheric environments of the Arctic, during the northern summer of 2019. language code: en);
change note: 2018-12-04 13:16:33.0 [sritz] insert AltLabel (id: null category: primary text: Greenland Circumnavigation Expedition language code: en);
change note: 2018-12-04 13:15:55.0 [sritz] Insert Concept add broader relation (GLACE [079a6731-d427-4b2b-bd22-86dd49fc0256,368281] - G - I [af0968ce-ffe3-44a0-86de-2ec9b9a8fa5d,351587]);
in scheme: projects
definition: Greenland Circumnavigation Expedition; Description: The Greenland Circumnavigation Expedition (GLACE) will provide access to the remote and as yet critically understudied Northern Greenland area and provide a unique opportunity to investigate the marine, terrestrial, atmospheric, and cryospheric environments of the Arctic, during the northern summer of 2019.