NON-GOVERNMENT/NON-PROFIT ORGANIZATIONS
type: Concept

DU/SR
type: Concept
in scheme: providers
definition: The Southern Regional Office (SRO), located in Ridgeland, MS was established in 1990 to protect and restore wetlands and other wildlife habitat in the southeastern United States. Today, the SRO carries out conservation programs in 15 southern states that include some of the most important wintering habitat on the continent. More than one million acres of waterfowl habitat has been conserved from Kansas south to Texas, east to Florida, and north to the Carolinas. Two-thirds of North America's waterfowl spend the winter in DU's Southern Region. Ducks and geese depend on wintering habitat in southern latitudes to feed, rest, and build vital energy reserves. Many species form breeding pair-bonds before beginning their arduous journeys to northern breeding areas. Research has shown that the quality of habitat on the wintering grounds affects winter survival rates and the condition of birds returning north. Summary provided by http://www.ducks.org/Conservation/SouthernRegionalOffice/1878/SouthernRegionalOffice.html