FMPL-2
type: Concept
change note: 2021-04-30 13:00:39.0 [mmorahan] insert AltLabel (id: null category: primary text: Flexible Microwave Payload version2 language code: en); insert Definition (id: null text: Flexible Microwave Payload version2 is a dual microwave payload composed of a GNSS-Reflectometer and L-band radiometer with interference detection/mitigation. language code: en); insert WeightedRelation (id: null related concept uuid: b369f647-96ad-4418-84d2-ee5fed065863 relationship type: null relationship value: null generated by: null);
change note: 2021-04-30 12:53:58.0 [mmorahan] Insert Concept add broader relation (FMPL-2 [08e2249f-3fc9-4084-85fd-17131c5a1cbb,578434] - Radiometers [5b753e40-b3f1-426a-8d92-ffee1d675468,566965]);
in scheme: instruments
definition: Flexible Microwave Payload version2 is a dual microwave payload composed of a GNSS-Reflectometer and L-band radiometer with interference detection/mitigation.

Radiometers
type: Concept