MARINE ECOSYSTEMS
type: Concept

BENTHIC
type: Concept
change note: 2016-07-12 10:09:22.0 [gee-cee] update PrefLabel (BENTHIC);
change note: 2016-07-12 10:09:06.0 [gee-cee] Move Concepts delete broader relation (null); add broader relation (BENTHIC HABITAT [09a78997-581b-4d1b-ae71-b2b3f96ef719,84257] - MARINE ECOSYSTEMS [f6350232-b1c7-458c-bc43-bda357ebb6db,84271]);
in scheme: sciencekeywords
definition: Pertaining to ocean bottom as the place where an organism lives.