CIVIL DISTURBANCE
type: Concept
change note: 2012-07-11 09:52:16.0 [tbs1979] update Definition (U. S. Department of Defense); update Definition (Group acts of violence and disorder prejudicial to public law and order.);
in scheme: sciencekeywords
definition: Group acts of violence and disorder prejudicial to public law and order.

ENVIRONMENTAL IMPACTS
type: Concept