Catchment-LSM
type: Concept
in scheme: platforms
change note: 2021-11-30 13:35:16.0 [tstevens] Move Concepts delete broader relation (null); add broader relation (Catchment-LSM [09ef7548-5e64-4296-8129-0ab625e15721,825953] - Models [0a184cdc-c074-4946-90a6-02f03c686341,835911]);
change note: 2014-07-29 21:27:32.0 [saritz] Insert Concept add broader relation (Catchment-LSM [09ef7548-5e64-4296-8129-0ab625e15721,106525] - Models [113ecbc2-ab36-4d58-a96c-a6ce0106e749,73395]);
change note: 2014-07-29 21:28:06.0 [saritz] insert AltLabel (id: null text: Catchment Land Surface Model language code: en);
change note: 2022-03-11 07:40:04.0 [tstevens] insert Definition (id: null text: Catchment model uses the Mosaic land cover classification and soils, topographic, and other model-specific parameters were derived in a consistent manner as in the NASA/GMAO's GEOS-5 climate modeling system. language code: en);
definition: Catchment model uses the Mosaic land cover classification and soils, topographic, and other model-specific parameters were derived in a consistent manner as in the NASA/GMAO's GEOS-5 climate modeling system.

Models
type: Concept