GERMANY
type: Concept

DE/GFZ/ISDC
type: Concept
in scheme: providers
definition: ISDC's online service portal is an access point for all manner of geoscientific geodata, its corresponding metadata, scientific documentation and software tools. The majority of the data and information, the portal currently offers to the public, are global geomonitoring products such as satellite orbit and Earth gravity field data as well as geomagnetic and atmospheric data for the exploration. These products for Earths changing system are provided via state-of-the art retrieval techniques. The ISDC portal's design and the operation is a project of the ISDC-team within the GFZ's Data Center.