LMER
type: Concept
in scheme: projects
definition: The Chesapeake Bay Land Margin Ecosystem Reserch (LMER) project investigates mechanisms affecting secondary production of estuarine ecosystems. The Chesapeake Bay LMER project, called Trophic Interactions in Estuarine Systems, or TIES, began in 1995 and is scheduled to run until the year 2000. The project uses Chesapeake Bay to investigate mechanisms controlling secondary product ion in estuarine ecosystems. For more information, link to "http://www.chesapeake.org/ties/overview/overview.html"

J - L
type: Concept