AU/CSIRO/PUB
type: Concept
in scheme: providers
definition: Company Description: Manufacturing: CSIRO Publishing is a publisher and exporter of scientific and technical information. The CD-ROM product range focuses on the natural sciences, agriculture and ecology. Summary Provided By: http://goliath.ecnext.com/coms2/merc-compint-0000865061-Commonwealth-Scientific-and-Industrial-Research.html

AUSTRALIA
type: Concept