ABRACOS
type: Concept
in scheme: projects
definition: The ABRACOS project is a collaboration between the Agencia Brasileira de Cooperacao and the UK Overseas Development Administration. Data is made available by the UK Istitute of Hydrology and the Instituto Nacional de Pesquisas Espaciais (Brazil-INPE). Datasets relating to Climate, Micrometeorology, Evaporation, Physiology, Carbon Dioxide Fluxes, and Soil Physics have been produced by this project. The ABRACOS datasets are available via World Wide Web. Link to: "http://lba.cptec.inpe.br/lba/prelba/abracos/index.html"

A - C
type: Concept