Imaging Radars
type: Concept

CSG-SAR
type: Concept
change note: 2021-06-22 15:28:31.0 [mmorahan] insert AltLabel (id: null category: primary text: COSMO-SkyMed Second Generation Synthetic Aperture Radar language code: en); insert Definition (id: null text: The CSG-SAR is a multi-mode instrument, conceived to provide a wide range of performance through different implementations (measurement modes) of the three major SAR acquisition techniques (Stripmap, Spotlight and ScanSAR). language code: en); insert WeightedRelation (id: null related concept uuid: b359999f-bb1e-43de-ae6e-1e9dc44e752a relationship type: null relationship value: null generated by: null);
change note: 2021-06-22 15:19:32.0 [mmorahan] Insert Concept add broader relation (CSG-SAR [0ae11ffd-d606-4b8a-b6ec-6bdfe75a149c,649579] - Imaging Radars [824070fa-da29-40fa-ba17-f3d60584bd4d,641694]);
in scheme: instruments
definition: The CSG-SAR is a multi-mode instrument, conceived to provide a wide range of performance through different implementations (measurement modes) of the three major SAR acquisition techniques (Stripmap, Spotlight and ScanSAR).