DSS
type: Concept
in scheme: projects
definition: This project is designed to bring together a wide range of scholars, students, institutions, and approaches to study the key-concepts of movement, communication and strategies among arctic peoples. Information provided by http://www.ipy.org/index.php?/ipy/detail/dynamic_social_strategies

D - F
type: Concept