BAYLOR/CAGSR
type: Concept
in scheme: providers
definition: Commonly referred to as GRASS, this is a Geographic Information System (GIS) used for geospatial data management and analysis, image processing, graphics/maps production, spatial modeling, and visualization. GRASS is currently used in academic and commercial settings around the world, as well as by many governmental agencies and environmental consulting companies. Information provided by: http://grass.baylor.edu/

ACADEMIC
type: Concept