A - C
type: Concept

ARIA
type: Concept
definition: The Advanced Rapid Imaging and Analysis (ARIA) Project will bring geodetic imaging capabilities to an operational level in support of local, national, and international hazard science and response communities. The Advanced Rapid Imaging and Analysis (ARIA) Project, a joint effort of California Institute of Technology (Caltech) and the Jet Propulsion Laboratory (JPL), is developing the infrastructure to generate imaging products in near real-time that can improve situational awareness for disaster response. The ARIA Project is also developing provide automated imaging and analysis capabilities necessary to keep up with the increase in raw data from geodetic imaging missions planned for launch by NASA, as well as international space agencies. More Information: https://aria.jpl.nasa.gov/
in scheme: projects
change note: 2019-09-06 14:32:31.0 [sritz] insert AltLabel (id: null category: primary text: Advanced Rapid Imaging and Analysis language code: en);
change note: 2019-09-06 14:30:50.0 [sritz] Insert Concept add broader relation (ARIA [0b66955e-f979-41bd-9fa4-69536fc698d4,369117] - A - C [0c89f3f4-7ab1-43ce-89ee-795d35f0e30a,349499]);
change note: 2019-09-06 14:34:07.0 [sritz] insert Definition (id: null text: The Advanced Rapid Imaging and Analysis (ARIA) Project will bring geodetic imaging capabilities to an operational level in support of local, national, and international hazard science and response communities. The Advanced Rapid Imaging and Analysis (ARIA) Project, a joint effort of California Institute of Technology (Caltech) and the Jet Propulsion Laboratory (JPL), is developing the infrastructure to generate imaging products in near real-time that can improve situational awareness for disaster response. The ARIA Project is also developing provide automated imaging and analysis capabilities necessary to keep up with the increase in raw data from geodetic imaging missions planned for launch by NASA, as well as international space agencies. More Information: https://aria.jpl.nasa.gov/ language code: en);