Jet
type: Concept

DLR-Falcon
type: Concept
change note: 2021-03-02 09:59:56.0 [sritz] insert AltLabel (id: null category: primary text: DLR-Falcon 20 Aircraft language code: en); insert Definition (id: null text: Among its fleet of highly modified aircraft the twin engine jet Falcon 20 E covers the largest flight envelope and is one of the few aircraft in Europe which is able to reach the stratosphere well above the cruise altitude of most airliners. The Falcon offers unique modifications and features which make it a true multipurpose sensor platform which can be configured to the individual needs of multiple applications. language code: en);
change note: 2021-11-16 15:13:47.0 [tstevens] Cut Concepts delete broader relation (null); add broader relation (DLR-Falcon [0c31ed1c-8ec6-4f7c-ac27-23fb428b7415,825967] - Trash Can/Platforms [6089b3e5-7db9-46e1-b73b-2d679f34abb4,831469]);
change note: 2021-11-16 15:13:57.0 [tstevens] Move Concepts delete broader relation (null); add broader relation (DLR-Falcon [0c31ed1c-8ec6-4f7c-ac27-23fb428b7415,825967] - Jet [5b8e4067-db4e-42d4-b4a5-7de5e683125d,835881]);
change note: 2021-03-02 09:58:56.0 [sritz] Insert Concept add broader relation (DLR-Falcon [0c31ed1c-8ec6-4f7c-ac27-23fb428b7415,560904] - Aircraft [227d9c3d-f631-402d-84ed-b8c5a562fc27,541399]);
definition: Among its fleet of highly modified aircraft the twin engine jet Falcon 20 E covers the largest flight envelope and is one of the few aircraft in Europe which is able to reach the stratosphere well above the cruise altitude of most airliners. The Falcon offers unique modifications and features which make it a true multipurpose sensor platform which can be configured to the individual needs of multiple applications.
in scheme: platforms