FR/INRA/UMR BIO3P
type: Concept
in scheme: providers
definition: Our research aims at developing a better knowledge on (1) the biology of plant pathogens (bacteria, fungi, viruses), aphids, nematodes, and helpers organisms (natural enemies, pollinators), (2) the interactions these organisms may develop together and with their host plant and their environment (soil, climate, human activity). This research is designed toward the setting up and improvement of plant protection methods, taking into account sustainability, respect of the environment, and low input utilisation.

ACADEMIC
type: Concept