DOC/NOAA/NESDIS/NODC/COL
type: Concept
change note: 2022-11-07 17:07:10.0 [sritz] update Definition (https://coastalscience.noaa.gov/); update Resource (provider); update Resource (https://coastalscience.noaa.gov/);
in scheme: providers
definition: The Coastal Ocean Laboratory (COL) participates in the acquisition of global oceanographic data, with emphasis on the coastal oceans, estuaries, bays, adjoining seas, and the Great Lakes, processes the data, and ingests the data into databases. It develops product databases and other derived products for use by NODC's various coastal ocean stakeholders, and it maintains databases online for electronic access by the coastal science and stewardship constituency. The COL performs research and develops new methods and techniques for using coastal physical, biological, and chemical oceanographic data, collected at great expense to the United States and foreign countries, to determine the role of various processes within the world coastal oceans that contribute to the coastal marine system. The COL prepares NODC technical publications and prepares scientific papers/articles for scientific journals and meetings. The COL defines requirements for new NODC coastal ocean data and inform ation products, and coordinates the development of such products. [Summary provided by the COL]

NOAA
type: Concept